Target
Carbonic anhydrase 9
Ligand
BDBM50107369
Substrate
Meas. Tech.
ChEMBL_1509205 (CHEMBL3602838)
Ki
72±n/a nM
Citation
 Khloya, PCeruso, MRam, SSupuran, CTSharma, PK Sulfonamide bearing pyrazolylpyrazolines as potent inhibitors of carbonic anhydrase isoforms I, II, IX and XII. Bioorg Med Chem Lett 25:3208-12 (2015)  
Target
Name:
Carbonic anhydrase 9
Synonyms:
CA-IX CAH9_HUMAN Carbonic anhydrase 9 (CA IX) Carbonic anhydrase 9 precursor Carbonic anhydrase IX (CAIX) Carbonic anhydrases; II & IX MN RCC-associated antigen G250
Type:
Enzyme
Mol. Mass.:
49669.03
Organism:
Homo sapiens (Human)
Description:
Catalytic domain of human cloned isozyme was used in the assay
Residue:
459
  
Inhibitor
Name:
BDBM50107369
Synonyms:
CHEMBL3601390
Type:
Small organic molecule
Emp. Form.:
C25H23ClN6O4S2
Mol. Mass.:
571.071
SMILES:
Cc1nn(c(Cl)c1C1CC(=NN1c1ccc(cc1)S(N)(=O)=O)c1ccccc1)-c1ccc(cc1)S(N)(=O)=O
: