Target
Carbonic anhydrase 2
Ligand
BDBM50107342
Substrate
Meas. Tech.
ChEMBL_1509204 (CHEMBL3602837)
Ki
3.1±n/a nM
Citation
 Khloya, PCeruso, MRam, SSupuran, CTSharma, PK Sulfonamide bearing pyrazolylpyrazolines as potent inhibitors of carbonic anhydrase isoforms I, II, IX and XII. Bioorg Med Chem Lett 25:3208-12 (2015)  
Target
Name:
Carbonic anhydrase 2
Synonyms:
CA-II CAC Carbonate dehydratase II Carbonic anhydrase 2 (CA-II) Carbonic anhydrase C Carbonic anhydrase II (CA-II) Carbonic anhydrase II (hCA II) | Carbonic anhydrase isoenzyme II (hCA II)
Type:
Enzyme
Mol. Mass.:
29250.71
Organism:
Homo sapiens (Human)
Description:
P00918
Residue:
260
  
Inhibitor
Name:
BDBM50107342
Synonyms:
CHEMBL3601394
Type:
Small organic molecule
Emp. Form.:
C25H22Cl2N6O4S2
Mol. Mass.:
605.516
SMILES:
Cc1nn(c(Cl)c1C1CC(=NN1c1ccc(cc1)S(N)(=O)=O)c1ccc(Cl)cc1)-c1ccc(cc1)S(N)(=O)=O
: