Target
Carbonic anhydrase 12
Ligand
BDBM50028267
Substrate
Meas. Tech.
ChEMBL_1508206 (CHEMBL3603163)
Ki
60±n/a nM
Citation
 Mahon, BPLomelino, CLLadwig, JRankin, GMDriscoll, JMSalguero, ALPinard, MAVullo, DSupuran, CTPoulsen, SAMcKenna, R Mapping Selective Inhibition of the Cancer-Related Carbonic Anhydrase IX Using Structure-Activity Relationships of Glucosyl-Based Sulfamates. J Med Chem 58:6630-8 (2015)  
Target
Name:
Carbonic anhydrase 12
Synonyms:
CA-XII CAH12_HUMAN Carbonic anhydrase Carbonic anhydrase XII Carbonic anhydrase XII (CAXII) | Tumor antigen HOM-RCC-3.1.3
Type:
Enzyme
Mol. Mass.:
39456.00
Organism:
Homo sapiens (Human)
Description:
Catalytic domain of human cloned isozyme was used in the assay
Residue:
354
  
Inhibitor
Name:
BDBM50028267
Synonyms:
CHEMBL3342250
Type:
Small organic molecule
Emp. Form.:
C19H30N2O14S2
Mol. Mass.:
574.577
SMILES:
CC(=O)OC[C@H]1O[C@H]([C@H](OC(C)=O)[C@@H](OC(C)=O)[C@@H]1OC(C)=O)S(=O)(=O)N1CCC(CC1)OS(N)(=O)=O
: