Target
Carbonic anhydrase 12
Ligand
BDBM50028265
Substrate
Meas. Tech.
ChEMBL_1508206 (CHEMBL3603163)
Ki
1.000000±n/a nM
Citation
 Mahon, BPLomelino, CLLadwig, JRankin, GMDriscoll, JMSalguero, ALPinard, MAVullo, DSupuran, CTPoulsen, SAMcKenna, R Mapping Selective Inhibition of the Cancer-Related Carbonic Anhydrase IX Using Structure-Activity Relationships of Glucosyl-Based Sulfamates. J Med Chem 58:6630-8 (2015)  
Target
Name:
Carbonic anhydrase 12
Synonyms:
CA-XII CAH12_HUMAN Carbonic anhydrase Carbonic anhydrase XII Carbonic anhydrase XII (CAXII) | Tumor antigen HOM-RCC-3.1.3
Type:
Enzyme
Mol. Mass.:
39456.00
Organism:
Homo sapiens (Human)
Description:
Catalytic domain of human cloned isozyme was used in the assay
Residue:
354
  
Inhibitor
Name:
BDBM50028265
Synonyms:
CHEMBL3342252
Type:
Small organic molecule
Emp. Form.:
C20H30N2O16S2
Mol. Mass.:
618.586
SMILES:
COC(=O)[C@@H]1C[C@H](CN1S(=O)(=O)[C@@H]1O[C@H](COC(C)=O)[C@@H](OC(C)=O)[C@H](OC(C)=O)[C@H]1OC(C)=O)OS(N)(=O)=O
: