Target
Epidermal growth factor receptor
Ligand
BDBM50383274
Substrate
Meas. Tech.
ChEMBL_1510113 (CHEMBL3606403)
IC50
10.0±n/a nM
Citation
 Engel, JRichters, AGetlik, MTomassi, SKeul, MTermathe, MLategahn, JBecker, CMayer-Wrangowski, SGrütter, CUhlenbrock, NKrüll, JSchaumann, NEppmann, SKibies, PHoffgaard, FHeil, JMenninger, SOrtiz-Cuaran, SHeuckmann, JMTinnefeld, VZahedi, RPSos, MLSchultz-Fademrecht, CThomas, RKKast, SMRauh, D Targeting Drug Resistance in EGFR with Covalent Inhibitors: A Structure-Based Design Approach. J Med Chem 58:6844-63 (2015)  
Target
Name:
Epidermal growth factor receptor
Synonyms:
EGF Receptor Substrate EGFR_HUMAN ERBB1 Epidermal Growth Factor Receptor erbB-1 Epidermal growth factor receptor (EGFR) HER1 Proto-oncogene c-ErbB-1 Tyrosine-Protein Kinase ErbB-1
Type:
Receptor Kinase Domain
Mol. Mass.:
134279.59
Organism:
Homo sapiens (Human)
Description:
P00533
Residue:
1210
  
Inhibitor
Name:
BDBM50383274
Synonyms:
CHEMBL1229592 US9670213, WZ4002
Type:
Small organic molecule
Emp. Form.:
C25H27ClN6O3
Mol. Mass.:
494.973
SMILES:
COc1cc(ccc1Nc1ncc(Cl)c(Oc2cccc(NC(=O)C=C)c2)n1)N1CCN(C)CC1
: