Target
Melanocortin receptor 3
Ligand
BDBM50112899
Substrate
Meas. Tech.
ChEMBL_1508712 (CHEMBL3602975)
EC50
16±n/a nM
Citation
 Cai, MMarelli, UKBao, JBeck, JGOpperer, FRechenmacher, FMcLeod, KRZingsheim, MRDoedens, LKessler, HHruby, VJ Systematic Backbone Conformational Constraints on a Cyclic Melanotropin Ligand Leads to Highly Selective Ligands for Multiple Melanocortin Receptors. J Med Chem 58:6359-67 (2015)  
Target
Name:
Melanocortin receptor 3
Synonyms:
MC3-R MC3R_HUMAN Melanocortin receptor (M3 and M4)
Type:
Enzyme
Mol. Mass.:
36044.86
Organism:
Homo sapiens (Human)
Description:
P41968
Residue:
323
  
Inhibitor
Name:
BDBM50112899
Synonyms:
CHEMBL3600842
Type:
Small organic molecule
Emp. Form.:
C56H75N15O9
Mol. Mass.:
1102.2898
SMILES:
CCCC[C@@H](NC(C)=O)C(=O)N[C@H]1CC(=O)NCCCC[C@H](NC(=O)[C@H](Cc2c[nH]c3ccccc23)N(C)C(=O)[C@H](CCCNC(N)=N)NC(=O)[C@@H](Cc2ccc3ccccc3c2)NC(=O)[C@H](Cc2cnc[nH]2)N(C)C1=O)C(N)=O
: