Target
Oxysterols receptor LXR-beta
Ligand
BDBM50115192
Substrate
Meas. Tech.
ChEMBL_1513596 (CHEMBL3610216)
EC50
530±n/a nM
Citation
 Matsui, YYamaguchi, TYamazaki, TYoshida, MArai, MTerasaka, NHonzumi, SWakabayashi, KHayashi, SNakai, DHanzawa, HTamaki, K Discovery and structure-guided optimization of tert-butyl 6-(phenoxymethyl)-3-(trifluoromethyl)benzoates as liver X receptor agonists. Bioorg Med Chem Lett 25:3914-20 (2015)  
Target
Name:
Oxysterols receptor LXR-beta
Synonyms:
LXRB Liver X, LXR beta NR1H2 Nuclear receptor NER Ubiquitously-expressed nuclear receptor
Type:
Enzyme Catalytic Domain
Mol. Mass.:
50978.79
Organism:
Homo sapiens (Human)
Description:
P55055
Residue:
460
  
Inhibitor
Name:
BDBM50115192
Synonyms:
CHEMBL3609572
Type:
Small organic molecule
Emp. Form.:
C27H25F3O6
Mol. Mass.:
502.479
SMILES:
CC(C)(C)OC(=O)c1c(O)c(ccc1COc1ccc(cc1)-c1cccc(CC(O)=O)c1)C(F)(F)F
: