Target
Oxysterols receptor LXR-beta
Ligand
BDBM50115194
Substrate
Meas. Tech.
ChEMBL_1513596 (CHEMBL3610216)
EC50
210±n/a nM
Citation
 Matsui, YYamaguchi, TYamazaki, TYoshida, MArai, MTerasaka, NHonzumi, SWakabayashi, KHayashi, SNakai, DHanzawa, HTamaki, K Discovery and structure-guided optimization of tert-butyl 6-(phenoxymethyl)-3-(trifluoromethyl)benzoates as liver X receptor agonists. Bioorg Med Chem Lett 25:3914-20 (2015)  
Target
Name:
Oxysterols receptor LXR-beta
Synonyms:
LXRB Liver X, LXR beta NR1H2 Nuclear receptor NER Ubiquitously-expressed nuclear receptor
Type:
Enzyme Catalytic Domain
Mol. Mass.:
50978.79
Organism:
Homo sapiens (Human)
Description:
P55055
Residue:
460
  
Inhibitor
Name:
BDBM50115194
Synonyms:
CHEMBL3609362
Type:
Small organic molecule
Emp. Form.:
C22H24F3NO4
Mol. Mass.:
423.4255
SMILES:
CN(C(C)=O)c1ccc(OCc2ccc(cc2C(=O)OC(C)(C)C)C(F)(F)F)cc1
: