Target
Oxysterols receptor LXR-alpha
Ligand
BDBM50115194
Substrate
Meas. Tech.
ChEMBL_1513495 (CHEMBL3611851)
EC50
310±n/a nM
Citation
 Matsui, YYamaguchi, TYamazaki, TYoshida, MArai, MTerasaka, NHonzumi, SWakabayashi, KHayashi, SNakai, DHanzawa, HTamaki, K Discovery and structure-guided optimization of tert-butyl 6-(phenoxymethyl)-3-(trifluoromethyl)benzoates as liver X receptor agonists. Bioorg Med Chem Lett 25:3914-20 (2015)  
Target
Name:
Oxysterols receptor LXR-alpha
Synonyms:
LXRA Liver X receptor alpha Liver X receptor alpha (NR1H3) NR1H3 Nuclear orphan receptor LXR-alpha | Nuclear receptor subfamily 1 group H member 3
Type:
Enzyme Catalytic Domain
Mol. Mass.:
50403.85
Organism:
Homo sapiens (Human)
Description:
Q13133
Residue:
447
  
Inhibitor
Name:
BDBM50115194
Synonyms:
CHEMBL3609362
Type:
Small organic molecule
Emp. Form.:
C22H24F3NO4
Mol. Mass.:
423.4255
SMILES:
CN(C(C)=O)c1ccc(OCc2ccc(cc2C(=O)OC(C)(C)C)C(F)(F)F)cc1
: