Target
Oxysterols receptor LXR-alpha
Ligand
BDBM50115195
Substrate
Meas. Tech.
ChEMBL_1513495 (CHEMBL3611851)
EC50
540±n/a nM
Citation
 Matsui, YYamaguchi, TYamazaki, TYoshida, MArai, MTerasaka, NHonzumi, SWakabayashi, KHayashi, SNakai, DHanzawa, HTamaki, K Discovery and structure-guided optimization of tert-butyl 6-(phenoxymethyl)-3-(trifluoromethyl)benzoates as liver X receptor agonists. Bioorg Med Chem Lett 25:3914-20 (2015)  
Target
Name:
Oxysterols receptor LXR-alpha
Synonyms:
LXRA Liver X receptor alpha Liver X receptor alpha (NR1H3) NR1H3 Nuclear orphan receptor LXR-alpha | Nuclear receptor subfamily 1 group H member 3
Type:
Enzyme Catalytic Domain
Mol. Mass.:
50403.85
Organism:
Homo sapiens (Human)
Description:
Q13133
Residue:
447
  
Inhibitor
Name:
BDBM50115195
Synonyms:
CHEMBL3609361
Type:
Small organic molecule
Emp. Form.:
C32H29ClF3NO3
Mol. Mass.:
568.026
SMILES:
OC(=O)c1cccc(OCCCN(CC(c2ccccc2)c2ccccc2)Cc2cccc(c2Cl)C(F)(F)F)c1
: