Target
Potassium voltage-gated channel subfamily A member 3
Ligand
BDBM50115569
Substrate
Meas. Tech.
ChEMBL_1513934 (CHEMBL3611616)
IC50
0.199±n/a nM
Citation
 Murray, JKQian, YXLiu, BElliott, RAral, JPark, CZhang, XStenkilsson, MSalyers, KRose, MLi, HYu, SAndrews, KLColombero, AWerner, JGaida, KSickmier, EAMiu, PItano, AMcGivern, JGegg, CVSullivan, JKMiranda, LP Pharmaceutical Optimization of Peptide Toxins for Ion Channel Targets: Potent, Selective, and Long-Lived Antagonists of Kv1.3. J Med Chem 58:6784-802 (2015)  
Target
Name:
Potassium voltage-gated channel subfamily A member 3
Synonyms:
HGK5 HPCN3 KCNA3 Potassium voltage-gated channel subfamily A member 3 Voltage-gated potassium channel subunit Kv1.3
Type:
PROTEIN
Mol. Mass.:
63835.47
Organism:
Homo sapiens (Human)
Description:
ChEMBL_1513935
Residue:
575
  
Inhibitor
Name:
BDBM50115569
Synonyms:
CHEMBL3609231
Type:
Small organic molecule
Emp. Form.:
C166H268N54O48S7
Mol. Mass.:
4012.692
SMILES:
[H][C@@]12CCCN1C(=O)[C@@]([H])(NC(=O)[C@@]([H])(NC(=O)[C@H](CC(O)=O)NC(=O)[C@@]([H])(NC(=O)[C@H](CSSC[C@H](NC(=O)[C@@]([H])(NC(=O)CNC(=O)[C@]1([H])CSSC[C@]3([H])NC(=O)[C@H](CCC(N)=O)NC(=O)[C@H](Cc4ccccc4)NC(=O)[C@H](C)NC(=O)[C@@]([H])(NC(=O)[C@]([H])(CSSC[C@]([H])(NC(=O)[C@H](Cc4ccccc4)NC(=O)[C@H](CO)NC(=O)[C@H](C)NC(=O)[C@H](CCCNC(N)=N)NC(=O)[C@H](Cc4ccc(O)cc4)NC(=O)[C@H](CCCCN)NC(=O)[C@H](CCSC)NC(=O)[C@H](CO)NC(=O)[C@H](Cc4cnc[nH]4)NC(=O)[C@H](CCCCN)NC3=O)C(=O)N[C@@H](CCCNC(N)=N)C(=O)N[C@@H](CCCCN)C(=O)N[C@@]([H])([C@@H](C)O)C(=O)N1)NC(=O)[C@H](CCCNC(N)=N)NC(=O)[C@H](CO)NC(=O)[C@H](CCCCN)NC2=O)[C@@H](C)O)[C@@H](C)O)C(O)=O)NC(=O)[C@H](CO)NC(=O)[C@@H](N)CCCNC(N)=N)[C@@H](C)CC)[C@@H](C)O)[C@@H](C)CC
: