Target
Voltage-dependent L-type calcium channel subunit alpha-1C
Ligand
BDBM50116525
Substrate
Meas. Tech.
ChEMBL_1512774 (CHEMBL3611367)
IC50
455±n/a nM
Citation
 Renneberg, DHubler, FRey, MHess, PDelahaye, SGatfield, JIglarz, MHilpert, K Discovery of novel bridged tetrahydronaphthalene derivatives as potent T/L-type calcium channel blockers. Bioorg Med Chem Lett 25:3941-6 (2015)  
Target
Name:
Voltage-dependent L-type calcium channel subunit alpha-1C
Synonyms:
CAC1C_HUMAN CACN2 CACNL1A1 Calcium channel (Type L) L-type calcium channel alpha-1c/beta-2/alpha2delta-1 Voltage-gated L-type calcium channel Voltage-gated calcium channel | Voltage-gated calcium channel subunit alpha Cav1.2
Type:
Enzyme Catalytic Domain
Mol. Mass.:
248979.79
Organism:
Homo sapiens (Human)
Description:
Calcium channel (Type L) 0 HUMAN::Q13936
Residue:
2221
  
Inhibitor
Name:
BDBM50116525
Synonyms:
CHEMBL3609818
Type:
Small organic molecule
Emp. Form.:
C30H39N3O2
Mol. Mass.:
473.6496
SMILES:
[H][C@]12C[C@](CCN(C)CCCc3nc4ccccc4[nH]3)(OC(=O)C(C)C)[C@]([H])(CCC1)c1ccccc21
: