Target
Amine oxidase [flavin-containing] A
Ligand
BDBM50042986
Substrate
Meas. Tech.
ChEMBL_1514157 (CHEMBL3614600)
IC50
>100000±n/a nM
Citation
 Choi, JWJang, BKCho, NCPark, JHYeon, SKJu, EJLee, YSHan, GPae, ANKim, DJPark, KD Synthesis of a series of unsaturated ketone derivatives as selective and reversible monoamine oxidase inhibitors. Bioorg Med Chem 23:6486-96 (2015)  
Target
Name:
Amine oxidase [flavin-containing] A
Synonyms:
AOFA_HUMAN MAO-A Monoamine oxidase Monoamine oxidase type A (MAO A) Monoamine oxidase type A (MAOA)
Type:
Protein
Mol. Mass.:
59689.53
Organism:
Homo sapiens (Human)
Description:
P21397
Residue:
527
  
Inhibitor
Name:
BDBM50042986
Synonyms:
(E)-1-(4-Hydroxy-phenyl)-3-phenyl-propenone 1-(4-hydroxyphenyl)-3-phenylprop-2-en-1-one | CHEMBL276473
Type:
Small organic molecule
Emp. Form.:
C15H12O2
Mol. Mass.:
224.2546
SMILES:
Oc1ccc(cc1)C(=O)\C=C\c1ccccc1
: