Target
Amine oxidase [flavin-containing] A
Ligand
BDBM50117997
Substrate
Meas. Tech.
ChEMBL_1514157 (CHEMBL3614600)
IC50
>100000±n/a nM
Citation
 Choi, JWJang, BKCho, NCPark, JHYeon, SKJu, EJLee, YSHan, GPae, ANKim, DJPark, KD Synthesis of a series of unsaturated ketone derivatives as selective and reversible monoamine oxidase inhibitors. Bioorg Med Chem 23:6486-96 (2015)  
Target
Name:
Amine oxidase [flavin-containing] A
Synonyms:
AOFA_HUMAN MAO-A Monoamine oxidase Monoamine oxidase type A (MAO A) Monoamine oxidase type A (MAOA)
Type:
Protein
Mol. Mass.:
59689.53
Organism:
Homo sapiens (Human)
Description:
P21397
Residue:
527
  
Inhibitor
Name:
BDBM50117997
Synonyms:
CHEMBL3613265
Type:
Small organic molecule
Emp. Form.:
C17H14F3NO2
Mol. Mass.:
321.2938
SMILES:
COc1ccc(NC(=O)\C=C\c2ccccc2C(F)(F)F)cc1
: