Target
Amine oxidase [flavin-containing] B
Ligand
BDBM77817
Substrate
Meas. Tech.
ChEMBL_1514156 (CHEMBL3614599)
IC50
2820±n/a nM
Citation
 Choi, JWJang, BKCho, NCPark, JHYeon, SKJu, EJLee, YSHan, GPae, ANKim, DJPark, KD Synthesis of a series of unsaturated ketone derivatives as selective and reversible monoamine oxidase inhibitors. Bioorg Med Chem 23:6486-96 (2015)  
Target
Name:
Amine oxidase [flavin-containing] B
Synonyms:
AOFB_HUMAN MAOB Monoamine oxidase type B (MAO B) Monoamine oxidase type B (MAOB)
Type:
Protein
Mol. Mass.:
58768.76
Organism:
Homo sapiens (Human)
Description:
P27338
Residue:
520
  
Inhibitor
Name:
BDBM77817
Synonyms:
(E)-3-(2-chlorophenyl)-N-phenyl-2-propenamide (E)-3-(2-chlorophenyl)-N-phenyl-prop-2-enamide MLS000859034 SMR000459213 | cid_737170
Type:
Small organic molecule
Emp. Form.:
C15H12ClNO
Mol. Mass.:
257.715
SMILES:
Clc1ccccc1\C=C\C(=O)Nc1ccccc1
: