Target
Amine oxidase [flavin-containing] B
Ligand
BDBM152633
Substrate
Meas. Tech.
ChEMBL_1514156 (CHEMBL3614599)
IC50
56±n/a nM
Citation
 Choi, JWJang, BKCho, NCPark, JHYeon, SKJu, EJLee, YSHan, GPae, ANKim, DJPark, KD Synthesis of a series of unsaturated ketone derivatives as selective and reversible monoamine oxidase inhibitors. Bioorg Med Chem 23:6486-96 (2015)  
Target
Name:
Amine oxidase [flavin-containing] B
Synonyms:
AOFB_HUMAN MAOB Monoamine oxidase type B (MAO B) Monoamine oxidase type B (MAOB)
Type:
Protein
Mol. Mass.:
58768.76
Organism:
Homo sapiens (Human)
Description:
P27338
Residue:
520
  
Inhibitor
Name:
BDBM152633
Synonyms:
(2E)-3-(2-fluorophenyl)-1-(4-methoxyphenyl)prop-2-en-1-one (M1)
Type:
Small organic molecule
Emp. Form.:
C16H13FO2
Mol. Mass.:
256.2716
SMILES:
COc1ccc(cc1)C(=O)\C=C\c1ccccc1F
: