Target
Protein phosphatase 1D
Ligand
BDBM50118476
Substrate
Meas. Tech.
ChEMBL_1515092 (CHEMBL3614136)
IC50
215±n/a nM
Citation
 Ogasawara, SKiyota, YChuman, YKowata, AYoshimura, FTanino, KKamada, RSakaguchi, K Novel inhibitors targeting PPM1D phosphatase potently suppress cancer cell proliferation. Bioorg Med Chem 23:6246-9 (2015)  
Target
Name:
Protein phosphatase 1D
Synonyms:
PP2C-delta PPM1D_HUMAN Protein phosphatase magnesium-dependent 1 delta p53-induced protein phosphatase 1
Type:
PROTEIN
Mol. Mass.:
66695.55
Organism:
Homo sapiens (Human)
Description:
ChEMBL_1515094
Residue:
605
  
Inhibitor
Name:
BDBM50118476
Synonyms:
CHEMBL3613747
Type:
Small organic molecule
Emp. Form.:
C24H50O3Si2
Mol. Mass.:
442.823
SMILES:
[H][C@]12C[C@@H](C[C@@](C)(CO)[C@]1([H])CCC[C@H]2O[Si](CC)(CC)CC)O[Si](C)(C)C(C)(C)C
: