Target
Sphingosine 1-phosphate receptor 2
Ligand
BDBM50120574
Substrate
Meas. Tech.
ChEMBL_1518043 (CHEMBL3619044)
IC50
1100±n/a nM
Citation
 Kusumi, KShinozaki, KYamaura, YHashimoto, AKurata, HNaganawa, AUeda, HOtsuki, KMatsushita, TSekiguchi, TKakuuchi, ASeko, T Discovery of novel S1P2 antagonists. Part 2: Improving the profile of a series of 1,3-bis(aryloxy)benzene derivatives. Bioorg Med Chem Lett 25:4387-92 (2015)  
Target
Name:
Sphingosine 1-phosphate receptor 2
Synonyms:
EDG5 S1PR2 Sphingosine 1-phosphate receptor Sphingosine-1-phosphate receptor 2 | ndothelial differentiation G-protein coupled receptor 5
Type:
G Protein-Coupled Receptor (GPCR)
Mol. Mass.:
38883.16
Organism:
Homo sapiens (Human)
Description:
Membranes isolated from S1P2-transfected CHO cells were used in ligand binding assay.
Residue:
353
  
Inhibitor
Name:
BDBM50120574
Synonyms:
CHEMBL3618191
Type:
Small organic molecule
Emp. Form.:
C19H25F4N3O
Mol. Mass.:
387.4149
SMILES:
CCC(CC)CC1(O)CCN(CC1)c1nc2c(F)cc(cc2[nH]1)C(F)(F)F
: