Target
Sphingosine 1-phosphate receptor 2
Ligand
BDBM50120576
Substrate
Meas. Tech.
ChEMBL_1518043 (CHEMBL3619044)
IC50
9500±n/a nM
Citation
 Kusumi, KShinozaki, KYamaura, YHashimoto, AKurata, HNaganawa, AUeda, HOtsuki, KMatsushita, TSekiguchi, TKakuuchi, ASeko, T Discovery of novel S1P2 antagonists. Part 2: Improving the profile of a series of 1,3-bis(aryloxy)benzene derivatives. Bioorg Med Chem Lett 25:4387-92 (2015)  
Target
Name:
Sphingosine 1-phosphate receptor 2
Synonyms:
EDG5 S1PR2 Sphingosine 1-phosphate receptor Sphingosine-1-phosphate receptor 2 | ndothelial differentiation G-protein coupled receptor 5
Type:
G Protein-Coupled Receptor (GPCR)
Mol. Mass.:
38883.16
Organism:
Homo sapiens (Human)
Description:
Membranes isolated from S1P2-transfected CHO cells were used in ligand binding assay.
Residue:
353
  
Inhibitor
Name:
BDBM50120576
Synonyms:
CHEMBL3618193
Type:
Small organic molecule
Emp. Form.:
C19H17F5N2O2
Mol. Mass.:
400.3425
SMILES:
OC1(CCN(CC1)C(=O)Nc1cc(F)cc(c1)C(F)(F)F)c1ccc(F)cc1
: