Target
Melanin-concentrating hormone receptor 1
Ligand
BDBM50120629
Substrate
Meas. Tech.
ChEMBL_1518193 (CHEMBL3619840)
Ki
1.8±n/a nM
Citation
 Devasthale, PWang, WMignone, JRenduchintala, KRadhakrishnan, SDhanapal, JSelvaraj, JKuppusamy, RPelleymounter, MALonghi, DHuang, NFlynn, NAzzara, AVRohrbach, KDevenny, JRooney, SThomas, MGlick, SGodonis, HHarvey, SCullen, MJZhang, HCaporuscio, CStetsko, PGrubb, MHuang, CZhang, LFreeden, CMurphy, BJRobl, JAWashburn, WN Non-basic azolotriazinone MCHR1 antagonists for the treatment of obesity: An empirical brain-exposures-driven candidate selection for in vivo efficacy studies. Bioorg Med Chem Lett 25:4412-8 (2015)  
Target
Name:
Melanin-concentrating hormone receptor 1
Synonyms:
G-protein coupled receptor 24 MCH receptor 1 MCH-R1 MCHR MCHR1_RAT Melanin Concentrating Hormone 1 Melanin-concentrating hormone receptor 1 Slc1 | Somatostatin receptor-like protein
Type:
Enzyme Catalytic Domain
Mol. Mass.:
39075.64
Organism:
RAT
Description:
Melanin Concentrating Hormone 1 GPR24 RAT::P97639
Residue:
353
  
Inhibitor
Name:
BDBM50120629
Synonyms:
CHEMBL3618336
Type:
Small organic molecule
Emp. Form.:
C23H22ClN3O4
Mol. Mass.:
439.891
SMILES:
COc1cc(ccc1OCC(C)(C)O)-n1cnn2cc(cc2c1=O)-c1ccc(Cl)cc1
: