Target
Melanin-concentrating hormone receptor 1
Ligand
BDBM50120624
Substrate
Meas. Tech.
ChEMBL_1518192 (CHEMBL3619839)
Ki
0.500000±n/a nM
Citation
 Devasthale, PWang, WMignone, JRenduchintala, KRadhakrishnan, SDhanapal, JSelvaraj, JKuppusamy, RPelleymounter, MALonghi, DHuang, NFlynn, NAzzara, AVRohrbach, KDevenny, JRooney, SThomas, MGlick, SGodonis, HHarvey, SCullen, MJZhang, HCaporuscio, CStetsko, PGrubb, MHuang, CZhang, LFreeden, CMurphy, BJRobl, JAWashburn, WN Non-basic azolotriazinone MCHR1 antagonists for the treatment of obesity: An empirical brain-exposures-driven candidate selection for in vivo efficacy studies. Bioorg Med Chem Lett 25:4412-8 (2015)  
Target
Name:
Melanin-concentrating hormone receptor 1
Synonyms:
G-protein coupled receptor 24 MCH receptor 1 MCH-R1 MCHR-1 MCHR1_HUMAN Melanin-Concentrating Hormone Receptor 1 (MCH1R) Melanin-concentrating hormone receptor 1 (MCH-1) Melanin-concentrating hormone receptor 1 (MCHR-1) SLC-1 Somatostatin receptor-like protein
Type:
G Protein-Coupled Receptor (GPCR)
Mol. Mass.:
45976.27
Organism:
Homo sapiens (Human)
Description:
Membranes from CHO-K1 cells stably expressing human MCH1R were used in assays.
Residue:
422
  
Inhibitor
Name:
BDBM50120624
Synonyms:
CHEMBL3618324
Type:
Small organic molecule
Emp. Form.:
C25H25ClN4O3
Mol. Mass.:
464.944
SMILES:
COc1cc(ccc1OCCN1CCCC1)-n1cnn2cc(cc2c1=O)-c1ccc(Cl)cc1
: