Target
D(3) dopamine receptor
Ligand
BDBM50121335
Substrate
Meas. Tech.
ChEMBL_1522245 (CHEMBL3626474)
Ki
89±n/a nM
Citation
 Stucchi, MGmeiner, PHuebner, HRainoldi, GSacchetti, ASilvani, ALesma, G Multicomponent Synthesis and Biological Evaluation of a Piperazine-Based Dopamine Receptor Ligand Library. ACS Med Chem Lett 6:882-7 (2015)  
Target
Name:
D(3) dopamine receptor
Synonyms:
DOPAMINE D3 DRD3_HUMAN Dopamine D3 receptor (D3) Dopamine receptor Dopamine receptor D3
Type:
Mol. Mass.:
44243.43
Organism:
Homo sapiens (Human)
Description:
Residue:
400
  
Inhibitor
Name:
BDBM50121335
Synonyms:
CHEMBL3622099
Type:
Small organic molecule
Emp. Form.:
C25H33BrN4
Mol. Mass.:
469.46
SMILES:
CCCN(CCN1CCN(CCc2c[nH]c3ccccc23)CC1)c1ccc(Br)cc1
: