Target
D(3) dopamine receptor
Ligand
BDBM50121342
Substrate
Meas. Tech.
ChEMBL_1522245 (CHEMBL3626474)
Ki
18000±n/a nM
Citation
 Stucchi, MGmeiner, PHuebner, HRainoldi, GSacchetti, ASilvani, ALesma, G Multicomponent Synthesis and Biological Evaluation of a Piperazine-Based Dopamine Receptor Ligand Library. ACS Med Chem Lett 6:882-7 (2015)  
Target
Name:
D(3) dopamine receptor
Synonyms:
DOPAMINE D3 DRD3_HUMAN Dopamine D3 receptor (D3) Dopamine receptor Dopamine receptor D3
Type:
Mol. Mass.:
44243.43
Organism:
Homo sapiens (Human)
Description:
Residue:
400
  
Inhibitor
Name:
BDBM50121342
Synonyms:
CHEMBL3622092
Type:
Small organic molecule
Emp. Form.:
C22H28N4O
Mol. Mass.:
364.4839
SMILES:
COc1ccc(NCCN2CCN(Cc3cc4ccccc4[nH]3)CC2)cc1
: