Target
D(4) dopamine receptor
Ligand
BDBM50121337
Substrate
Meas. Tech.
ChEMBL_1522249 (CHEMBL3626478)
Ki
20±n/a nM
Citation
 Stucchi, MGmeiner, PHuebner, HRainoldi, GSacchetti, ASilvani, ALesma, G Multicomponent Synthesis and Biological Evaluation of a Piperazine-Based Dopamine Receptor Ligand Library. ACS Med Chem Lett 6:882-7 (2015)  
Target
Name:
D(4) dopamine receptor
Synonyms:
D(2C) dopamine receptor DOPAMINE D4.2 DRD4 Dopamine D4 receptor
Type:
Enzyme
Mol. Mass.:
48373.19
Organism:
Homo sapiens (Human)
Description:
P21917
Residue:
419
  
Inhibitor
Name:
BDBM50121337
Synonyms:
CHEMBL3622097
Type:
Small organic molecule
Emp. Form.:
C22H27BrN4
Mol. Mass.:
427.381
SMILES:
Brc1ccc(NCCN2CCN(CCc3c[nH]c4ccccc34)CC2)cc1
: