Target
D(1B) dopamine receptor
Ligand
BDBM50121337
Substrate
Meas. Tech.
ChEMBL_1522248 (CHEMBL3626477)
Ki
3600±n/a nM
Citation
 Stucchi, MGmeiner, PHuebner, HRainoldi, GSacchetti, ASilvani, ALesma, G Multicomponent Synthesis and Biological Evaluation of a Piperazine-Based Dopamine Receptor Ligand Library. ACS Med Chem Lett 6:882-7 (2015)  
Target
Name:
D(1B) dopamine receptor
Synonyms:
D(5) dopamine receptor DOPAMINE D5 DRD1L2 DRD5_HUMAN | dopamine receptor D5
Type:
Protein
Mol. Mass.:
52943.41
Organism:
Homo sapiens (Human)
Description:
P21918
Residue:
477
  
Inhibitor
Name:
BDBM50121337
Synonyms:
CHEMBL3622097
Type:
Small organic molecule
Emp. Form.:
C22H27BrN4
Mol. Mass.:
427.381
SMILES:
Brc1ccc(NCCN2CCN(CCc3c[nH]c4ccccc34)CC2)cc1
: