Target
D(2) dopamine receptor
Ligand
BDBM50121337
Substrate
Meas. Tech.
ChEMBL_1522246 (CHEMBL3626475)
Ki
48±n/a nM
Citation
 Stucchi, MGmeiner, PHuebner, HRainoldi, GSacchetti, ASilvani, ALesma, G Multicomponent Synthesis and Biological Evaluation of a Piperazine-Based Dopamine Receptor Ligand Library. ACS Med Chem Lett 6:882-7 (2015)  
Target
Name:
D(2) dopamine receptor
Synonyms:
D(2) dopamine receptor DOPAMINE D2 Long DRD2 Dopamine D2 receptor Dopamine D2 receptor (D2R) Dopamine2-like | d2
Type:
Cell-surface receptors
Mol. Mass.:
50647.10
Organism:
Homo sapiens (Human)
Description:
P14416
Residue:
443
  
Inhibitor
Name:
BDBM50121337
Synonyms:
CHEMBL3622097
Type:
Small organic molecule
Emp. Form.:
C22H27BrN4
Mol. Mass.:
427.381
SMILES:
Brc1ccc(NCCN2CCN(CCc3c[nH]c4ccccc34)CC2)cc1
: