Target
Aldo-keto reductase family 1 member C2
Ligand
BDBM50124576
Substrate
Meas. Tech.
ChEMBL_1520856 (CHEMBL3626241)
IC50
14000±n/a nM
Citation
 Hendriks, CMPenning, TMZang, TWiemuth, DGründer, SSanhueza, IASchoenebeck, FBolm, C Pentafluorosulfanyl-containing flufenamic acid analogs: Syntheses, properties and biological activities. Bioorg Med Chem Lett 25:4437-40 (2015)  
Target
Name:
Aldo-keto reductase family 1 member C2
Synonyms:
3-alpha-HSD3 AK1C2_HUMAN Aldo-keto reductase family 1 member C2 (AK1C2) Aldo-keto reductase family 1 member C2 (AKR1C2) DD-2 DDH2 Dihydrodiol dehydrogenase/bile acid-binding protein Type III 3-alpha-hydroxysteroid dehydrogenase
Type:
Enzyme
Mol. Mass.:
36739.89
Organism:
Homo sapiens (Human)
Description:
Residue:
323
  
Inhibitor
Name:
BDBM50124576
Synonyms:
CHEMBL3623736
Type:
Small organic molecule
Emp. Form.:
C13H10F5NO2S
Mol. Mass.:
339.281
SMILES:
OC(=O)c1cccc(Nc2cccc(c2)S(F)(F)(F)(F)F)c1
: