Target
Prostaglandin G/H synthase 2
Ligand
BDBM50124576
Substrate
Meas. Tech.
ChEMBL_1520859 (CHEMBL3626244)
IC50
>100000±n/a nM
Citation
 Hendriks, CMPenning, TMZang, TWiemuth, DGründer, SSanhueza, IASchoenebeck, FBolm, C Pentafluorosulfanyl-containing flufenamic acid analogs: Syntheses, properties and biological activities. Bioorg Med Chem Lett 25:4437-40 (2015)  
Target
Name:
Prostaglandin G/H synthase 2
Synonyms:
COX2 Cyclooxygenase 2 (COX-2) Cyclooxygenase-2 (COX-2 AA) Cyclooxygenase-2 (COX-2) PGH2_HUMAN PHS II Prostaglandin E synthase/G/H synthase 2 Prostaglandin-endoperoxide synthase 2
Type:
Enzyme
Mol. Mass.:
69003.89
Organism:
Homo sapiens (Human)
Description:
Recombinant Cox-2 provided by Cayman (Cayman Chemical Co.,Ann Arbor, MI).
Residue:
604
  
Inhibitor
Name:
BDBM50124576
Synonyms:
CHEMBL3623736
Type:
Small organic molecule
Emp. Form.:
C13H10F5NO2S
Mol. Mass.:
339.281
SMILES:
OC(=O)c1cccc(Nc2cccc(c2)S(F)(F)(F)(F)F)c1
: