Target
Neuronal acetylcholine receptor subunit alpha-7
Ligand
BDBM50127648
Substrate
Meas. Tech.
ChEMBL_1522501 (CHEMBL3631637)
Ki
73±n/a nM
Citation
 Deligia, FDeiana, VGotti, CLazzari, PBottazzi, MEPucci, LFasoli, FRagusa, GPinna, GAMurineddu, G Design of novel 3,6-diazabicyclo[3.1.1]heptane derivatives with potent and selective affinities fora4ß2 neuronal nicotinic acetylcholine receptors. Eur J Med Chem 103:429-37 (2015)  
Target
Name:
Neuronal acetylcholine receptor subunit alpha-7
Synonyms:
ACHA7_RAT Cholinergic, Nicotinic Alpha7 Chrna7 Neuronal acetylcholine receptor (alpha7 nAChR) Neuronal acetylcholine receptor subunit alpha-7 Neuronal acetylcholine receptor subunit alpha-7 (nAChR)
Type:
Enzyme
Mol. Mass.:
56502.44
Organism:
Rattus norvegicus (Rat)
Description:
Q05941
Residue:
502
  
Inhibitor
Name:
BDBM50127648
Synonyms:
CHEMBL3628495
Type:
Small organic molecule
Emp. Form.:
C10H12ClN3
Mol. Mass.:
209.675
SMILES:
Clc1cncc(c1)N1CC2CC(C1)N2
: