Target
Carbonic anhydrase 2
Ligand
BDBM7459
Substrate
Meas. Tech.
ChEBML_1523541
Temperature
298.15±n/a K
Ki
3692±n/a nM
Comments
extracted
Citation
 Karioti, ACeruso, MCarta, FBilia, ARSupuran, CT New natural product carbonic anhydrase inhibitors incorporating phenol moieties. Bioorg Med Chem 23:7219-25 (2015)  
Target
Name:
Carbonic anhydrase 2
Synonyms:
CA-II CAC Carbonate dehydratase II Carbonic anhydrase 2 (CA-II) Carbonic anhydrase C Carbonic anhydrase II (CA-II) Carbonic anhydrase II (hCA II) | Carbonic anhydrase isoenzyme II (hCA II)
Type:
Enzyme
Mol. Mass.:
29250.71
Organism:
Homo sapiens (Human)
Description:
P00918
Residue:
260
  
Inhibitor
Name:
BDBM7459
Synonyms:
2-(3,4-dihydroxyphenyl)-5,7-dihydroxy-4H-chromen-4-one CHEMBL151 Luteolin (4) cid_5280445 med.21724, Compound 3
Type:
Small organic molecule
Emp. Form.:
C15H10O6
Mol. Mass.:
286.2363
SMILES:
Oc1cc(O)c2c(c1)oc(cc2=O)-c1ccc(O)c(O)c1
: