Target
Oxytocin receptor
Ligand
BDBM50139179
Substrate
Meas. Tech.
ChEMBL_1555980 (CHEMBL3767488)
IC50
4129±n/a nM
Citation
 Jorgensen, WTGulliver, DWWerry, ELReekie, TConnor, MKassiou, M Flexible analogues of WAY-267,464: Synthesis and pharmacology at the human oxytocin and vasopressin 1a receptors. Eur J Med Chem 108:730-40 (2016)  
Target
Name:
Oxytocin receptor
Synonyms:
OT-R OXYR_HUMAN | Oxytocin
Type:
Enzyme Catalytic Domain
Mol. Mass.:
42793.26
Organism:
Homo sapiens (Human)
Description:
Oxytocin OXTR HEK293::B2R9L7
Residue:
389
  
Inhibitor
Name:
BDBM50139179
Synonyms:
CHEMBL3763951
Type:
Small organic molecule
Emp. Form.:
C34H39N7O4
Mol. Mass.:
609.718
SMILES:
COc1cc(CN2CCN(CC2)C(=O)NCc2ccc(cc2C)C(=O)N2Cc3cnn(C)c3Nc3ccccc23)cc(OC)c1
: