Target
Vasopressin V1a receptor
Ligand
BDBM50139178
Substrate
Meas. Tech.
ChEMBL_1555982 (CHEMBL3767490)
EC50
>10000±n/a nM
Citation
 Jorgensen, WTGulliver, DWWerry, ELReekie, TConnor, MKassiou, M Flexible analogues of WAY-267,464: Synthesis and pharmacology at the human oxytocin and vasopressin 1a receptors. Eur J Med Chem 108:730-40 (2016)  
Target
Name:
Vasopressin V1a receptor
Synonyms:
AVPR V1a AVPR1A V1AR_HUMAN VASOPRESSIN V1A Vasopressin V1 receptor Vasopressin receptor
Type:
Receptor
Mol. Mass.:
46820.18
Organism:
Homo sapiens (Human)
Description:
P37288
Residue:
418
  
Inhibitor
Name:
BDBM50139178
Synonyms:
CHEMBL3763342
Type:
Small organic molecule
Emp. Form.:
C32H35N7O4
Mol. Mass.:
581.6648
SMILES:
Cc1cc(ccc1CNC(=O)N1CCN(Cc2cc(O)cc(O)c2)CC1)C(=O)N1Cc2cnn(C)c2Nc2ccccc12
: