Target
Oxytocin receptor
Ligand
BDBM50139180
Substrate
Meas. Tech.
ChEMBL_1555978 (CHEMBL3767486)
Ki
>10000±n/a nM
Citation
 Jorgensen, WTGulliver, DWWerry, ELReekie, TConnor, MKassiou, M Flexible analogues of WAY-267,464: Synthesis and pharmacology at the human oxytocin and vasopressin 1a receptors. Eur J Med Chem 108:730-40 (2016)  
Target
Name:
Oxytocin receptor
Synonyms:
OT-R OXYR_HUMAN | Oxytocin
Type:
Enzyme Catalytic Domain
Mol. Mass.:
42793.26
Organism:
Homo sapiens (Human)
Description:
Oxytocin OXTR HEK293::B2R9L7
Residue:
389
  
Inhibitor
Name:
BDBM50139180
Synonyms:
CHEMBL3764572
Type:
Small organic molecule
Emp. Form.:
C27H34N6O3
Mol. Mass.:
490.5973
SMILES:
Cn1ncc2CN(C(=O)CCCCN3CCN(Cc4cc(O)cc(O)c4)CC3)c3ccccc3Nc12
: