Target
Casein kinase II subunit alpha
Ligand
BDBM50140975
Substrate
Meas. Tech.
ChEMBL_1548867 (CHEMBL3755571)
Ki
2490±n/a nM
Citation
 Lukowska-Chojnacka, EWinska, PWielechowska, MPoprzeczko, MBretner, M Synthesis of novel polybrominated benzimidazole derivatives-potential CK2 inhibitors with anticancer and proapoptotic activity. Bioorg Med Chem 24:735-41 (2016)  
Target
Name:
Casein kinase II subunit alpha
Synonyms:
CK II CK2- alpha CSK21_HUMAN Casein kinase 2 Casein kinase II alpha/beta Casein kinase II subunit alpha (CK2A1) Casein kinase II subunit alpha (CK2a V66A) Casein kinase II subunit alpha (CK2a)
Type:
Enzyme
Mol. Mass.:
45151.12
Organism:
Homo sapiens (Human)
Description:
P68400
Residue:
391
  
Inhibitor
Name:
BDBM50140975
Synonyms:
CHEMBL3751963
Type:
Small organic molecule
Emp. Form.:
C11H7Br4N3
Mol. Mass.:
500.809
SMILES:
Brc1c(Br)c(Br)c2n(CCCC#N)cnc2c1Br
: