Target
Prostaglandin E synthase
Ligand
BDBM50393040
Substrate
Meas. Tech.
ChEMBL_1552422 (CHEMBL3761673)
IC50
198±n/a nM
Citation
 Schiffler, MAAntonysamy, SBhattachar, SNCampanale, KMChandrasekhar, SCondon, BDesai, PVFisher, MJGroshong, CHarvey, AHickey, MJHughes, NEJones, SAKim, EJKuklish, SLLuz, JGNorman, BHRathmell, RERizzo, JRSeng, TWThibodeaux, SJWoods, TAYork, JSYu, XP Discovery and Characterization of 2-Acylaminoimidazole Microsomal Prostaglandin E Synthase-1 Inhibitors. J Med Chem 59:194-205 (2016)  
Target
Name:
Prostaglandin E synthase
Synonyms:
MGST1L1 PGES PTGES Prostaglandin E synthase (PGES-1) Prostaglandin E synthase-1 (PGES-1) Prostaglandin E2 synthase-1 ( mPGES-1)
Type:
Protein
Mol. Mass.:
17112.22
Organism:
Homo sapiens (Human)
Description:
Residue:
152
  
Inhibitor
Name:
BDBM50393040
Synonyms:
CHEMBL2152710
Type:
Small organic molecule
Emp. Form.:
C16H19BrN4O2
Mol. Mass.:
379.252
SMILES:
CC(C)(C)C(=O)NCc1ccc(Br)c(c1)C(=O)Nc1ncc[nH]1
: