Target
Carbonic anhydrase 2
Ligand
BDBM50146756
Substrate
Meas. Tech.
ChEMBL_1551385 (CHEMBL3762506)
Ki
50±n/a nM
Citation
 Lomelino, CLMahon, BPMcKenna, RCarta, FSupuran, CT Kinetic and X-ray crystallographic investigations on carbonic anhydrase isoforms I, II, IX and XII of a thioureido analog of SLC-0111. Bioorg Med Chem 24:976-81 (2016)  
Target
Name:
Carbonic anhydrase 2
Synonyms:
CA-II CAC Carbonate dehydratase II Carbonic anhydrase 2 (CA-II) Carbonic anhydrase C Carbonic anhydrase II (CA-II) Carbonic anhydrase II (hCA II) | Carbonic anhydrase isoenzyme II (hCA II)
Type:
Enzyme
Mol. Mass.:
29250.71
Organism:
Homo sapiens (Human)
Description:
P00918
Residue:
260
  
Inhibitor
Name:
BDBM50146756
Synonyms:
4-(3-Pentafluorophenyl-ureido)-benzenesulfonamide | CHEMBL316779
Type:
Small organic molecule
Emp. Form.:
C13H8F5N3O3S
Mol. Mass.:
381.278
SMILES:
NS(=O)(=O)c1ccc(NC(=O)Nc2c(F)c(F)c(F)c(F)c2F)cc1
: