Target
Carbonic anhydrase 9
Ligand
BDBM50146599
Substrate
Meas. Tech.
ChEMBL_1555758 (CHEMBL3766369)
Ki
208±n/a nM
Citation
 Cornelio, BLaronze-Cochard, MCeruso, MFerraroni, MRance, GACarta, FKhlobystov, ANFontana, ASupuran, CTSapi, J 4-Arylbenzenesulfonamides as Human Carbonic Anhydrase Inhibitors (hCAIs): Synthesis by Pd Nanocatalyst-Mediated Suzuki-Miyaura Reaction, Enzyme Inhibition, and X-ray Crystallographic Studies. J Med Chem 59:721-32 (2016)  
Target
Name:
Carbonic anhydrase 9
Synonyms:
CA-IX CAH9_HUMAN Carbonic anhydrase 9 (CA IX) Carbonic anhydrase 9 precursor Carbonic anhydrase IX (CAIX) Carbonic anhydrases; II & IX MN RCC-associated antigen G250
Type:
Enzyme
Mol. Mass.:
49669.03
Organism:
Homo sapiens (Human)
Description:
Catalytic domain of human cloned isozyme was used in the assay
Residue:
459
  
Inhibitor
Name:
BDBM50146599
Synonyms:
CHEMBL3763192
Type:
Small organic molecule
Emp. Form.:
C15H17NO2S
Mol. Mass.:
275.366
SMILES:
CC(C)c1ccccc1-c1ccc(cc1)S(N)(=O)=O
: