Target
Cholinesterase
Ligand
BDBM50147602
Substrate
Meas. Tech.
ChEMBL_1553286 (CHEMBL3767518)
IC50
5640±n/a nM
Citation
 Xie, SSLan, JSWang, XWang, ZMJiang, NLi, FWu, JJWang, JKong, LY Design, synthesis and biological evaluation of novel donepezil-coumarin hybrids as multi-target agents for the treatment of Alzheimer's disease. Bioorg Med Chem 24:1528-39 (2016)  
Target
Name:
Cholinesterase
Synonyms:
BCHE CHLE_HORSE | Cholinesterase
Type:
Enzyme
Mol. Mass.:
65643.35
Organism:
Equus caballus (Horse)
Description:
P81908
Residue:
574
  
Inhibitor
Name:
BDBM50147602
Synonyms:
CHEMBL3764166
Type:
Small organic molecule
Emp. Form.:
C24H28N2O4
Mol. Mass.:
408.4901
SMILES:
COc1cc(=O)oc2cc(OCCNC3CCN(Cc4ccccc4)CC3)ccc12
: