Target
Acetylcholinesterase
Ligand
BDBM50147601
Substrate
Meas. Tech.
ChEMBL_1553285 (CHEMBL3767517)
IC50
1500±n/a nM
Citation
 Xie, SSLan, JSWang, XWang, ZMJiang, NLi, FWu, JJWang, JKong, LY Design, synthesis and biological evaluation of novel donepezil-coumarin hybrids as multi-target agents for the treatment of Alzheimer's disease. Bioorg Med Chem 24:1528-39 (2016)  
Target
Name:
Acetylcholinesterase
Synonyms:
ACES_ELEEL Acetylcholinesterase (EeAChE) | ache
Type:
Enzyme
Mol. Mass.:
71812.79
Organism:
Electrophorus electricus (Electric eel)
Description:
Residue:
633
  
Inhibitor
Name:
BDBM50147601
Synonyms:
CHEMBL3765293
Type:
Small organic molecule
Emp. Form.:
C23H25ClN2O3
Mol. Mass.:
412.909
SMILES:
Clc1cc(=O)oc2cc(OCCNC3CCN(Cc4ccccc4)CC3)ccc12
: