Target
Cholinesterase
Ligand
BDBM50147609
Substrate
Meas. Tech.
ChEMBL_1553280 (CHEMBL3767512)
IC50
1980±n/a nM
Citation
 Xie, SSLan, JSWang, XWang, ZMJiang, NLi, FWu, JJWang, JKong, LY Design, synthesis and biological evaluation of novel donepezil-coumarin hybrids as multi-target agents for the treatment of Alzheimer's disease. Bioorg Med Chem 24:1528-39 (2016)  
Target
Name:
Cholinesterase
Synonyms:
Acylcholine acylhydrolase Butyrylcholine esterase (BChE) Butyrylcholinesterase (BuChE) CHLE_HUMAN Cholinesterases Pseudocholinesterase
Type:
Homotetramer
Mol. Mass.:
68422.27
Organism:
Homo sapiens (Human)
Description:
P06276
Residue:
602
  
Inhibitor
Name:
BDBM50147609
Synonyms:
CHEMBL3763535
Type:
Small organic molecule
Emp. Form.:
C27H32N2O3
Mol. Mass.:
432.5546
SMILES:
O=c1oc2cc(OCCNC3CCN(Cc4ccccc4)CC3)ccc2c2CCCCc12
: