Target
D(2) dopamine receptor
Ligand
BDBM50151313
Substrate
Meas. Tech.
ChEMBL_1559213 (CHEMBL3771916)
Ki
302±n/a nM
Citation
 Kucwaj-Brysz, KWarszycki, DPodlewska, SWitek, JWitek, KGonzález Izquierdo, ASatala, GLoza, MILubelska, ALatacz, GBojarski, AJCastro, MKiec-Kononowicz, KHandzlik, J Rational design in search for 5-phenylhydantoin selective 5-HT7R antagonists. Molecular modeling, synthesis and biological evaluation. Eur J Med Chem 112:258-69 (2016)  
Target
Name:
D(2) dopamine receptor
Synonyms:
D(2) dopamine receptor DOPAMINE D2 Long DRD2 Dopamine D2 receptor Dopamine D2 receptor (D2R) Dopamine2-like | d2
Type:
Cell-surface receptors
Mol. Mass.:
50647.10
Organism:
Homo sapiens (Human)
Description:
P14416
Residue:
443
  
Inhibitor
Name:
BDBM50151313
Synonyms:
CHEMBL3771309
Type:
Small organic molecule
Emp. Form.:
C23H25Cl2FN4O3
Mol. Mass.:
495.374
SMILES:
CC1(NC(=O)N(CC(O)CN2CCN(CC2)c2cccc(Cl)c2Cl)C1=O)c1ccc(F)cc1
: