Target
5-hydroxytryptamine receptor 1A
Ligand
BDBM50118336
Substrate
Meas. Tech.
ChEMBL_1560588 (CHEMBL3777320)
Ki
2.7±n/a nM
Citation
 Dosa, PIAmin, EA Tactical Approaches to Interconverting GPCR Agonists and Antagonists. J Med Chem 59:810-40 (2016)  
Target
Name:
5-hydroxytryptamine receptor 1A
Synonyms:
5-HT-1A 5-HT1A 5-hydroxytryptamine receptor 1A (5HT1A) 5ht1a Htr1a Serotonin 1a (5-HT1a) receptor/Adrenergic receptor alpha-1 | Serotonin receptor 1A
Type:
G Protein-Coupled Receptor (GPCR)
Mol. Mass.:
46445.29
Organism:
Rattus norvegicus (rat)
Description:
Binding assays were performed using rat hippocampal membranes.
Residue:
422
  
Inhibitor
Name:
BDBM50118336
Synonyms:
1-(5-Fluoro-benzo[b]thiophen-3-yl)-3-(4-quinolin-8-yl-piperazin-1-yl)-propan-1-ol; CHEMBL339501
Type:
Small organic molecule
Emp. Form.:
C24H24FN3OS
Mol. Mass.:
421.53
SMILES:
OC(CCN1CCN(CC1)c1cccc2cccnc12)c1csc2ccc(F)cc12
: