Target
Amine oxidase [flavin-containing] A
Ligand
BDBM50155763
Substrate
Meas. Tech.
ChEMBL_1564916 (CHEMBL3782873)
IC50
40±n/a nM
Citation
 Vianello, PBotrugno, OACappa, ADal Zuffo, RDessanti, PMai, AMarrocco, BMattevi, AMeroni, GMinucci, SStazi, GThaler, FTrifiró, PValente, SVilla, MVarasi, MMercurio, C Discovery of a Novel Inhibitor of Histone Lysine-Specific Demethylase 1A (KDM1A/LSD1) as Orally Active Antitumor Agent. J Med Chem 59:1501-17 (2016)  
Target
Name:
Amine oxidase [flavin-containing] A
Synonyms:
AOFA_HUMAN MAO-A Monoamine oxidase Monoamine oxidase type A (MAO A) Monoamine oxidase type A (MAOA)
Type:
Protein
Mol. Mass.:
59689.53
Organism:
Homo sapiens (Human)
Description:
P21397
Residue:
527
  
Inhibitor
Name:
BDBM50155763
Synonyms:
CHEMBL3780391
Type:
Small organic molecule
Emp. Form.:
C20H19ClN2O2
Mol. Mass.:
354.83
SMILES:
Cl.N[C@@H]1C[C@H]1c1ccc(NC(=O)c2ccc(cc2)-c2ccoc2)cc1
: