Target
Transient receptor potential cation channel subfamily A member 1
Ligand
BDBM50157698
Substrate
Meas. Tech.
ChEMBL_1568991 (CHEMBL3789591)
IC50
35±n/a nM
Citation
 Schenkel, LBOlivieri, PRBoezio, AADeak, HLEmkey, RGraceffa, RFGunaydin, HGuzman-Perez, ALee, JHTeffera, YWang, WYoungblood, BDYu, VLZhang, MGavva, NRLehto, SGGeuns-Meyer, S Optimization of a Novel Quinazolinone-Based Series of Transient Receptor Potential A1 (TRPA1) Antagonists Demonstrating Potent in Vivo Activity. J Med Chem 59:2794-809 (2016)  
Target
Name:
Transient receptor potential cation channel subfamily A member 1
Synonyms:
Anktm1 Trpa1
Type:
PROTEIN
Mol. Mass.:
128622.74
Organism:
Rattus norvegicus
Description:
ChEMBL_1450487
Residue:
1125
  
Inhibitor
Name:
BDBM50157698
Synonyms:
CHEMBL3787249
Type:
Small organic molecule
Emp. Form.:
C19H16ClN5O2
Mol. Mass.:
381.816
SMILES:
Cc1ccnc2ncn(Cc3nc(CCc4ccc(Cl)cc4)no3)c(=O)c12
: