Target
Transient receptor potential cation channel subfamily A member 1
Ligand
BDBM50157702
Substrate
Meas. Tech.
ChEMBL_1568991 (CHEMBL3789591)
IC50
75±n/a nM
Citation
 Schenkel, LBOlivieri, PRBoezio, AADeak, HLEmkey, RGraceffa, RFGunaydin, HGuzman-Perez, ALee, JHTeffera, YWang, WYoungblood, BDYu, VLZhang, MGavva, NRLehto, SGGeuns-Meyer, S Optimization of a Novel Quinazolinone-Based Series of Transient Receptor Potential A1 (TRPA1) Antagonists Demonstrating Potent in Vivo Activity. J Med Chem 59:2794-809 (2016)  
Target
Name:
Transient receptor potential cation channel subfamily A member 1
Synonyms:
Anktm1 Trpa1
Type:
PROTEIN
Mol. Mass.:
128622.74
Organism:
Rattus norvegicus
Description:
ChEMBL_1450487
Residue:
1125
  
Inhibitor
Name:
BDBM50157702
Synonyms:
CHEMBL3786639 US11136336, Med. Chem. 2016, 59, 2794-2809 Example 31
Type:
Small organic molecule
Emp. Form.:
C18H14ClN5O3
Mol. Mass.:
383.788
SMILES:
OC(Cc1noc(Cn2cnc3ncccc3c2=O)n1)c1ccc(Cl)cc1
: