Target
Serine/threonine-protein kinase 17A
Ligand
BDBM50166138
Substrate
Meas. Tech.
ChEMBL_1575377 (CHEMBL3802095)
IC50
500±n/a nM
Citation
 Jung, MEByun, BJKim, HMLee, JYPark, JHLee, NSon, YHChoi, SUYang, KMKim, SJLee, KKim, YCChoi, G Discovery of indirubin derivatives as new class of DRAK2 inhibitors from high throughput screening. Bioorg Med Chem Lett 26:2719-23 (2016)  
Target
Name:
Serine/threonine-protein kinase 17A
Synonyms:
DRAK1 STK17A
Type:
Enzyme Catalytic Domain
Mol. Mass.:
46544.04
Organism:
Homo sapiens (Human)
Description:
gi_109255245
Residue:
414
  
Inhibitor
Name:
BDBM50166138
Synonyms:
CHEMBL3799256
Type:
Small organic molecule
Emp. Form.:
C23H15N5O5
Mol. Mass.:
441.3957
SMILES:
O\N=C1\C(\Nc2ccccc\12)=C1\C(=O)Nc2ccc(NC(=O)c3ccc(cc3)[N+]([O-])=O)cc12
: