Target
Serine/threonine-protein kinase 17A
Ligand
BDBM50166254
Substrate
Meas. Tech.
ChEMBL_1575377 (CHEMBL3802095)
IC50
120±n/a nM
Citation
 Jung, MEByun, BJKim, HMLee, JYPark, JHLee, NSon, YHChoi, SUYang, KMKim, SJLee, KKim, YCChoi, G Discovery of indirubin derivatives as new class of DRAK2 inhibitors from high throughput screening. Bioorg Med Chem Lett 26:2719-23 (2016)  
Target
Name:
Serine/threonine-protein kinase 17A
Synonyms:
DRAK1 STK17A
Type:
Enzyme Catalytic Domain
Mol. Mass.:
46544.04
Organism:
Homo sapiens (Human)
Description:
gi_109255245
Residue:
414
  
Inhibitor
Name:
BDBM50166254
Synonyms:
CHEMBL3797466
Type:
Small organic molecule
Emp. Form.:
C21H18N4O3
Mol. Mass.:
374.3926
SMILES:
[#6]\[#6](-[#6])=[#6]\[#6](=O)-[#7]-c1ccc2-[#7]-[#6](=O)\[#6](=[#6]3/[#7]-c4ccccc4/[#6]/3=[#7]\[#8])-c2c1
: