Target
Serine/threonine-protein kinase 17B
Ligand
BDBM50166267
Substrate
Meas. Tech.
ChEMBL_1575376 (CHEMBL3802094)
IC50
950±n/a nM
Citation
 Jung, MEByun, BJKim, HMLee, JYPark, JHLee, NSon, YHChoi, SUYang, KMKim, SJLee, KKim, YCChoi, G Discovery of indirubin derivatives as new class of DRAK2 inhibitors from high throughput screening. Bioorg Med Chem Lett 26:2719-23 (2016)  
Target
Name:
Serine/threonine-protein kinase 17B
Synonyms:
DRAK2 STK17B Serine/threonine-protein kinase 17B (STK17B)
Type:
Enzyme
Mol. Mass.:
42332.49
Organism:
Homo sapiens (Human)
Description:
O94768
Residue:
372
  
Inhibitor
Name:
BDBM50166267
Synonyms:
CHEMBL3799218
Type:
Small organic molecule
Emp. Form.:
C24H17ClN4O4
Mol. Mass.:
460.869
SMILES:
O\N=C1\C(\Nc2ccccc\12)=C1\C(=O)Nc2ccc(NC(=O)COc3cccc(Cl)c3)cc12
: