Target
Serine/threonine-protein kinase 17B
Ligand
BDBM50304112
Substrate
Meas. Tech.
ChEMBL_1575376 (CHEMBL3802094)
IC50
250±n/a nM
Citation
 Jung, MEByun, BJKim, HMLee, JYPark, JHLee, NSon, YHChoi, SUYang, KMKim, SJLee, KKim, YCChoi, G Discovery of indirubin derivatives as new class of DRAK2 inhibitors from high throughput screening. Bioorg Med Chem Lett 26:2719-23 (2016)  
Target
Name:
Serine/threonine-protein kinase 17B
Synonyms:
DRAK2 STK17B Serine/threonine-protein kinase 17B (STK17B)
Type:
Enzyme
Mol. Mass.:
42332.49
Organism:
Homo sapiens (Human)
Description:
O94768
Residue:
372
  
Inhibitor
Name:
BDBM50304112
Synonyms:
(Z)-5'-Amino-1H,1'H-[2,3']biindolylidene-3,2'-dione 3-oxime CHEMBL604263
Type:
Small organic molecule
Emp. Form.:
C16H12N4O2
Mol. Mass.:
292.2921
SMILES:
Nc1ccc2NC(=O)C(c2c1)c1[nH]c2ccccc2c1N=O
: