Target
Serine/threonine-protein kinase 17A
Ligand
BDBM50166269
Substrate
Meas. Tech.
ChEMBL_1575377 (CHEMBL3802095)
IC50
360±n/a nM
Citation
 Jung, MEByun, BJKim, HMLee, JYPark, JHLee, NSon, YHChoi, SUYang, KMKim, SJLee, KKim, YCChoi, G Discovery of indirubin derivatives as new class of DRAK2 inhibitors from high throughput screening. Bioorg Med Chem Lett 26:2719-23 (2016)  
Target
Name:
Serine/threonine-protein kinase 17A
Synonyms:
DRAK1 STK17A
Type:
Enzyme Catalytic Domain
Mol. Mass.:
46544.04
Organism:
Homo sapiens (Human)
Description:
gi_109255245
Residue:
414
  
Inhibitor
Name:
BDBM50166269
Synonyms:
CHEMBL3797582
Type:
Small organic molecule
Emp. Form.:
C24H18N4O4
Mol. Mass.:
426.4241
SMILES:
COc1ccc(cc1)C(=O)Nc1ccc2NC(=O)\C(=C3/Nc4ccccc4/C/3=N\O)c2c1
: